Showing paste #375L:

Determining if the include file dirent.h exists failed with the following output:
Change Dir: D:/ApacheHTTP/srclib/pcre/CMakeFiles/CMakeTmp

Run Build Command:"C:/Program Files (x86)/Microsoft Visual Studio 9.0/Common7/IDE/devenv.com" "CMAKE_TRY_COMPILE.sln" "/build" "Debug" "/project" "cmTC_44838"


Microsoft (R) Visual Studio Version 9.0.30729.1.

Copyright (C) Microsoft Corp. All rights reserved.

1>------ Build started: Project: cmTC_44838, Configuration: Debug Win32 ------

1>Compiling...

1>Microsoft (R) 32-bit C/C++ Optimizing Compiler Version 15.00.30729.01 for 80x86

1>Copyright (C) Microsoft Corporation.  All rights reserved.

1>cl /Od /D "WIN32" /D "_WINDOWS" /D "_DEBUG" /D "CMAKE_INTDIR=\"Debug\"" /D "_MBCS" /FD /RTC1 /MDd /Fo"cmTC_44838.dir\Debug\\" /Fd"cmTC_44838.dir\Debug\vc90.pdb" /W3 /c /Zi /TC .\CheckIncludeFile.c

1>CheckIncludeFile.c

1>.\CheckIncludeFile.c(1) : fatal error C1083: Cannot open include file: 'dirent.h': No such file or directory

1>Build log was saved at "file://d:\ApacheHTTP\srclib\pcre\CMakeFiles\CMakeTmp\cmTC_44838.dir\Debug\BuildLog.htm"

1>cmTC_44838 - 1 error(s), 0 warning(s)

========== Build: 0 succeeded, 1 failed, 0 up-to-date, 0 skipped ==========



Determining if the include file stdint.h exists failed with the following output:
Change Dir: D:/ApacheHTTP/srclib/pcre/CMakeFiles/CMakeTmp

Run Build Command:"C:/Program Files (x86)/Microsoft Visual Studio 9.0/Common7/IDE/devenv.com" "CMAKE_TRY_COMPILE.sln" "/build" "Debug" "/project" "cmTC_accb2"


Microsoft (R) Visual Studio Version 9.0.30729.1.

Copyright (C) Microsoft Corp. All rights reserved.

1>------ Build started: Project: cmTC_accb2, Configuration: Debug Win32 ------

1>Compiling...

1>Microsoft (R) 32-bit C/C++ Optimizing Compiler Version 15.00.30729.01 for 80x86

1>Copyright (C) Microsoft Corporation.  All rights reserved.

1>cl /Od /D "WIN32" /D "_WINDOWS" /D "_DEBUG" /D "CMAKE_INTDIR=\"Debug\"" /D "_MBCS" /FD /RTC1 /MDd /Fo"cmTC_accb2.dir\Debug\\" /Fd"cmTC_accb2.dir\Debug\vc90.pdb" /W3 /c /Zi /TC .\CheckIncludeFile.c

1>CheckIncludeFile.c

1>.\CheckIncludeFile.c(1) : fatal error C1083: Cannot open include file: 'stdint.h': No such file or directory

1>Build log was saved at "file://d:\ApacheHTTP\srclib\pcre\CMakeFiles\CMakeTmp\cmTC_accb2.dir\Debug\BuildLog.htm"

1>cmTC_accb2 - 1 error(s), 0 warning(s)

========== Build: 0 succeeded, 1 failed, 0 up-to-date, 0 skipped ==========



Determining if the include file inttypes.h exists failed with the following output:
Change Dir: D:/ApacheHTTP/srclib/pcre/CMakeFiles/CMakeTmp

Run Build Command:"C:/Program Files (x86)/Microsoft Visual Studio 9.0/Common7/IDE/devenv.com" "CMAKE_TRY_COMPILE.sln" "/build" "Debug" "/project" "cmTC_7a490"


Microsoft (R) Visual Studio Version 9.0.30729.1.

Copyright (C) Microsoft Corp. All rights reserved.

1>------ Build started: Project: cmTC_7a490, Configuration: Debug Win32 ------

1>Compiling...

1>Microsoft (R) 32-bit C/C++ Optimizing Compiler Version 15.00.30729.01 for 80x86

1>Copyright (C) Microsoft Corporation.  All rights reserved.

1>cl /Od /D "WIN32" /D "_WINDOWS" /D "_DEBUG" /D "CMAKE_INTDIR=\"Debug\"" /D "_MBCS" /FD /RTC1 /MDd /Fo"cmTC_7a490.dir\Debug\\" /Fd"cmTC_7a490.dir\Debug\vc90.pdb" /W3 /c /Zi /TC .\CheckIncludeFile.c

1>CheckIncludeFile.c

1>.\CheckIncludeFile.c(1) : fatal error C1083: Cannot open include file: 'inttypes.h': No such file or directory

1>Build log was saved at "file://d:\ApacheHTTP\srclib\pcre\CMakeFiles\CMakeTmp\cmTC_7a490.dir\Debug\BuildLog.htm"

1>cmTC_7a490 - 1 error(s), 0 warning(s)

========== Build: 0 succeeded, 1 failed, 0 up-to-date, 0 skipped ==========



Determining if the include file unistd.h exists failed with the following output:
Change Dir: D:/ApacheHTTP/srclib/pcre/CMakeFiles/CMakeTmp

Run Build Command:"C:/Program Files (x86)/Microsoft Visual Studio 9.0/Common7/IDE/devenv.com" "CMAKE_TRY_COMPILE.sln" "/build" "Debug" "/project" "cmTC_e3358"


Microsoft (R) Visual Studio Version 9.0.30729.1.

Copyright (C) Microsoft Corp. All rights reserved.

1>------ Build started: Project: cmTC_e3358, Configuration: Debug Win32 ------

1>Compiling...

1>Microsoft (R) 32-bit C/C++ Optimizing Compiler Version 15.00.30729.01 for 80x86

1>Copyright (C) Microsoft Corporation.  All rights reserved.

1>cl /Od /D "WIN32" /D "_WINDOWS" /D "_DEBUG" /D "CMAKE_INTDIR=\"Debug\"" /D "_MBCS" /FD /RTC1 /MDd /Fo"cmTC_e3358.dir\Debug\\" /Fd"cmTC_e3358.dir\Debug\vc90.pdb" /W3 /c /Zi /TC .\CheckIncludeFile.c

1>CheckIncludeFile.c

1>.\CheckIncludeFile.c(1) : fatal error C1083: Cannot open include file: 'unistd.h': No such file or directory

1>Build log was saved at "file://d:\ApacheHTTP\srclib\pcre\CMakeFiles\CMakeTmp\cmTC_e3358.dir\Debug\BuildLog.htm"

1>cmTC_e3358 - 1 error(s), 0 warning(s)

========== Build: 0 succeeded, 1 failed, 0 up-to-date, 0 skipped ==========



Determining if the include file type_traits.h exists failed with the following output:
Change Dir: D:/ApacheHTTP/srclib/pcre/CMakeFiles/CMakeTmp

Run Build Command:"C:/Program Files (x86)/Microsoft Visual Studio 9.0/Common7/IDE/devenv.com" "CMAKE_TRY_COMPILE.sln" "/build" "Debug" "/project" "cmTC_35669"


Microsoft (R) Visual Studio Version 9.0.30729.1.

Copyright (C) Microsoft Corp. All rights reserved.

1>------ Build started: Project: cmTC_35669, Configuration: Debug Win32 ------

1>Compiling...

1>Microsoft (R) 32-bit C/C++ Optimizing Compiler Version 15.00.30729.01 for 80x86

1>Copyright (C) Microsoft Corporation.  All rights reserved.

1>cl /Od /D "WIN32" /D "_WINDOWS" /D "_DEBUG" /D "CMAKE_INTDIR=\"Debug\"" /D "_MBCS" /FD /EHsc /RTC1 /MDd /Fo"cmTC_35669.dir\Debug\\" /Fd"cmTC_35669.dir\Debug\vc90.pdb" /W3 /c /Zi /TP .\CheckIncludeFile.cxx

1>CheckIncludeFile.cxx

1>.\CheckIncludeFile.cxx(1) : fatal error C1083: Cannot open include file: 'type_traits.h': No such file or directory

1>Build log was saved at "file://d:\ApacheHTTP\srclib\pcre\CMakeFiles\CMakeTmp\cmTC_35669.dir\Debug\BuildLog.htm"

1>cmTC_35669 - 1 error(s), 0 warning(s)

========== Build: 0 succeeded, 1 failed, 0 up-to-date, 0 skipped ==========



Determining if the include file bits/type_traits.h exists failed with the following output:
Change Dir: D:/ApacheHTTP/srclib/pcre/CMakeFiles/CMakeTmp

Run Build Command:"C:/Program Files (x86)/Microsoft Visual Studio 9.0/Common7/IDE/devenv.com" "CMAKE_TRY_COMPILE.sln" "/build" "Debug" "/project" "cmTC_afd88"


Microsoft (R) Visual Studio Version 9.0.30729.1.

Copyright (C) Microsoft Corp. All rights reserved.

1>------ Build started: Project: cmTC_afd88, Configuration: Debug Win32 ------

1>Compiling...

1>Microsoft (R) 32-bit C/C++ Optimizing Compiler Version 15.00.30729.01 for 80x86

1>Copyright (C) Microsoft Corporation.  All rights reserved.

1>cl /Od /D "WIN32" /D "_WINDOWS" /D "_DEBUG" /D "CMAKE_INTDIR=\"Debug\"" /D "_MBCS" /FD /EHsc /RTC1 /MDd /Fo"cmTC_afd88.dir\Debug\\" /Fd"cmTC_afd88.dir\Debug\vc90.pdb" /W3 /c /Zi /TP .\CheckIncludeFile.cxx

1>CheckIncludeFile.cxx

1>.\CheckIncludeFile.cxx(1) : fatal error C1083: Cannot open include file: 'bits/type_traits.h': No such file or directory

1>Build log was saved at "file://d:\ApacheHTTP\srclib\pcre\CMakeFiles\CMakeTmp\cmTC_afd88.dir\Debug\BuildLog.htm"

1>cmTC_afd88 - 1 error(s), 0 warning(s)

========== Build: 0 succeeded, 1 failed, 0 up-to-date, 0 skipped ==========



Determining if the function bcopy exists failed with the following output:
Change Dir: D:/ApacheHTTP/srclib/pcre/CMakeFiles/CMakeTmp

Run Build Command:"C:/Program Files (x86)/Microsoft Visual Studio 9.0/Common7/IDE/devenv.com" "CMAKE_TRY_COMPILE.sln" "/build" "Debug" "/project" "cmTC_33914"


Microsoft (R) Visual Studio Version 9.0.30729.1.

Copyright (C) Microsoft Corp. All rights reserved.

1>------ Build started: Project: cmTC_33914, Configuration: Debug Win32 ------

1>Compiling...

1>Microsoft (R) 32-bit C/C++ Optimizing Compiler Version 15.00.30729.01 for 80x86

1>Copyright (C) Microsoft Corporation.  All rights reserved.

1>cl /Od /D "WIN32" /D "_WINDOWS" /D "CHECK_FUNCTION_EXISTS=bcopy" /D "_DEBUG" /D "CMAKE_INTDIR=\"Debug\"" /D "_MBCS" /FD /RTC1 /MDd /Fo"cmTC_33914.dir\Debug\\" /Fd"cmTC_33914.dir\Debug\vc90.pdb" /W3 /c /Zi /TC "..\..\..\..\..\ApacheUtill\cmake\share\cmake-3.7\Modules\CheckFunctionExists.c"

1>CheckFunctionExists.c

1>Compiling manifest to resources...

1>Microsoft (R) Windows (R) Resource Compiler Version 6.1.6723.1

1>Copyright (C) Microsoft Corporation.  All rights reserved.

1>Linking...

1>CheckFunctionExists.obj : error LNK2019: unresolved external symbol _bcopy referenced in function _main

1>D:\ApacheHTTP\srclib\pcre\CMakeFiles\CMakeTmp\Debug\cmTC_33914.exe : fatal error LNK1120: 1 unresolved externals

1>Build log was saved at "file://d:\ApacheHTTP\srclib\pcre\CMakeFiles\CMakeTmp\cmTC_33914.dir\Debug\BuildLog.htm"

1>cmTC_33914 - 2 error(s), 0 warning(s)

========== Build: 0 succeeded, 1 failed, 0 up-to-date, 0 skipped ==========



Determining if the function strtoll exists failed with the following output:
Change Dir: D:/ApacheHTTP/srclib/pcre/CMakeFiles/CMakeTmp

Run Build Command:"C:/Program Files (x86)/Microsoft Visual Studio 9.0/Common7/IDE/devenv.com" "CMAKE_TRY_COMPILE.sln" "/build" "Debug" "/project" "cmTC_eb9c1"


Microsoft (R) Visual Studio Version 9.0.30729.1.

Copyright (C) Microsoft Corp. All rights reserved.

1>------ Build started: Project: cmTC_eb9c1, Configuration: Debug Win32 ------

1>Compiling...

1>Microsoft (R) 32-bit C/C++ Optimizing Compiler Version 15.00.30729.01 for 80x86

1>Copyright (C) Microsoft Corporation.  All rights reserved.

1>cl /Od /D "WIN32" /D "_WINDOWS" /D "CHECK_FUNCTION_EXISTS=strtoll" /D "_DEBUG" /D "CMAKE_INTDIR=\"Debug\"" /D "_MBCS" /FD /RTC1 /MDd /Fo"cmTC_eb9c1.dir\Debug\\" /Fd"cmTC_eb9c1.dir\Debug\vc90.pdb" /W3 /c /Zi /TC "..\..\..\..\..\ApacheUtill\cmake\share\cmake-3.7\Modules\CheckFunctionExists.c"

1>CheckFunctionExists.c

1>Compiling manifest to resources...

1>Microsoft (R) Windows (R) Resource Compiler Version 6.1.6723.1

1>Copyright (C) Microsoft Corporation.  All rights reserved.

1>Linking...

1>CheckFunctionExists.obj : error LNK2019: unresolved external symbol _strtoll referenced in function _main

1>D:\ApacheHTTP\srclib\pcre\CMakeFiles\CMakeTmp\Debug\cmTC_eb9c1.exe : fatal error LNK1120: 1 unresolved externals

1>Build log was saved at "file://d:\ApacheHTTP\srclib\pcre\CMakeFiles\CMakeTmp\cmTC_eb9c1.dir\Debug\BuildLog.htm"

1>cmTC_eb9c1 - 2 error(s), 0 warning(s)

========== Build: 0 succeeded, 1 failed, 0 up-to-date, 0 skipped ==========



Determining if the function strtoq exists failed with the following output:
Change Dir: D:/ApacheHTTP/srclib/pcre/CMakeFiles/CMakeTmp

Run Build Command:"C:/Program Files (x86)/Microsoft Visual Studio 9.0/Common7/IDE/devenv.com" "CMAKE_TRY_COMPILE.sln" "/build" "Debug" "/project" "cmTC_66c07"


Microsoft (R) Visual Studio Version 9.0.30729.1.

Copyright (C) Microsoft Corp. All rights reserved.

1>------ Build started: Project: cmTC_66c07, Configuration: Debug Win32 ------

1>Compiling...

1>Microsoft (R) 32-bit C/C++ Optimizing Compiler Version 15.00.30729.01 for 80x86

1>Copyright (C) Microsoft Corporation.  All rights reserved.

1>cl /Od /D "WIN32" /D "_WINDOWS" /D "CHECK_FUNCTION_EXISTS=strtoq" /D "_DEBUG" /D "CMAKE_INTDIR=\"Debug\"" /D "_MBCS" /FD /RTC1 /MDd /Fo"cmTC_66c07.dir\Debug\\" /Fd"cmTC_66c07.dir\Debug\vc90.pdb" /W3 /c /Zi /TC "..\..\..\..\..\ApacheUtill\cmake\share\cmake-3.7\Modules\CheckFunctionExists.c"

1>CheckFunctionExists.c

1>Compiling manifest to resources...

1>Microsoft (R) Windows (R) Resource Compiler Version 6.1.6723.1

1>Copyright (C) Microsoft Corporation.  All rights reserved.

1>Linking...

1>CheckFunctionExists.obj : error LNK2019: unresolved external symbol _strtoq referenced in function _main

1>D:\ApacheHTTP\srclib\pcre\CMakeFiles\CMakeTmp\Debug\cmTC_66c07.exe : fatal error LNK1120: 1 unresolved externals

1>Build log was saved at "file://d:\ApacheHTTP\srclib\pcre\CMakeFiles\CMakeTmp\cmTC_66c07.dir\Debug\BuildLog.htm"

1>cmTC_66c07 - 2 error(s), 0 warning(s)

========== Build: 0 succeeded, 1 failed, 0 up-to-date, 0 skipped ==========



Make a new paste